lkml.org 
[lkml]   [2021]   [Dec]   [16]   [last100]   RSS Feed
Views: [wrap][no wrap]   [headers]  [forward] 
 
Messages in this thread
/
From
SubjectRe: [next] powerpc: book3s_hv.c:4591:27: error: 'struct kvm_vcpu' has no member named 'wait'
Date
Naresh Kamboju <naresh.kamboju@linaro.org> writes:
> [ Please ignore this email if it is already reported ]
>
> While building Linux next 20211214 powerpc defconfig with gcc-8/9/10/11
> following warnings / errors noticed.
>
> make --silent --keep-going --jobs=8
> O=/home/tuxbuild/.cache/tuxmake/builds/current ARCH=powerpc
> CROSS_COMPILE=powerpc64le-linux-gnu- 'CC=sccache
> powerpc64le-linux-gnu-gcc' 'HOSTCC=sccache gcc'
> arch/powerpc/kvm/book3s_hv.c: In function 'kvmhv_run_single_vcpu':
> arch/powerpc/kvm/book3s_hv.c:4591:27: error: 'struct kvm_vcpu' has no
> member named 'wait'
> prepare_to_rcuwait(&vcpu->wait);
> ^~
> arch/powerpc/kvm/book3s_hv.c:4608:23: error: 'struct kvm_vcpu' has no
> member named 'wait'
> finish_rcuwait(&vcpu->wait);
> ^~
> make[3]: *** [scripts/Makefile.build:289: arch/powerpc/kvm/book3s_hv.o] Error 1
>
> meta data:
> -----------
> git describe: next-20211214

Should be fixed in next-20211215 by:

63fa47ba886b ("KVM: PPC: Book3S HV P9: Use kvm_arch_vcpu_get_wait() to get rcuwait object")

cheers

\
 
 \ /
  Last update: 2021-12-16 06:26    [W:0.034 / U:0.012 seconds]
©2003-2020 Jasper Spaans|hosted at Digital Ocean and TransIP|Read the blog|Advertise on this site