lkml.org 
[lkml]   [2021]   [Nov]   [17]   [last100]   RSS Feed
Views: [wrap][no wrap]   [headers]  [forward] 
 
Messages in this thread
/
Date
From
Subject[mcgrof-next:20211117-sysctl-cleanups-all-set-04 20/36] include/linux/sysctl.h:230:1: error: expected ';' before '}' token
tree:   https://git.kernel.org/pub/scm/linux/kernel/git/mcgrof/linux-next.git 20211117-sysctl-cleanups-all-set-04
head: 3559bb8939dd93c96215ab179d868c5fdc167335
commit: e727f07ea75eda3892a29abc81b503ebc2bbcaf1 [20/36] sysctl: add helper to register a sysctl mount point
config: arc-randconfig-r043-20211117 (attached as .config)
compiler: arceb-elf-gcc (GCC) 11.2.0
reproduce (this is a W=1 build):
wget https://raw.githubusercontent.com/intel/lkp-tests/master/sbin/make.cross -O ~/bin/make.cross
chmod +x ~/bin/make.cross
# https://git.kernel.org/pub/scm/linux/kernel/git/mcgrof/linux-next.git/commit/?id=e727f07ea75eda3892a29abc81b503ebc2bbcaf1
git remote add mcgrof-next https://git.kernel.org/pub/scm/linux/kernel/git/mcgrof/linux-next.git
git fetch --no-tags mcgrof-next 20211117-sysctl-cleanups-all-set-04
git checkout e727f07ea75eda3892a29abc81b503ebc2bbcaf1
# save the attached .config to linux build tree
mkdir build_dir
COMPILER_INSTALL_PATH=$HOME/0day COMPILER=gcc-11.2.0 make.cross O=build_dir ARCH=arc prepare

If you fix the issue, kindly add following tag as appropriate
Reported-by: kernel test robot <lkp@intel.com>

All errors (new ones prefixed by >>):

arch/arc/Makefile:26: ** WARNING ** CONFIG_ARC_TUNE_MCPU flag '' is unknown, fallback to ''
error: no override and no default toolchain set
init/Kconfig:70:warning: 'RUSTC_VERSION': number is invalid
In file included from include/linux/key.h:17,
from include/linux/cred.h:13,
from include/linux/sched/signal.h:10,
from include/linux/rcuwait.h:6,
from include/linux/percpu-rwsem.h:7,
from include/linux/fs.h:33,
from include/linux/huge_mm.h:8,
from include/linux/mm.h:717,
from arch/arc/kernel/asm-offsets.c:7:
include/linux/sysctl.h: In function 'register_sysctl_mount_point':
>> include/linux/sysctl.h:230:1: error: expected ';' before '}' token
230 | }
| ^
At top level:
include/linux/sysctl.h:227:30: warning: 'register_sysctl_mount_point' defined but not used [-Wunused-function]
227 | static struct sysctl_header *register_sysctl_mount_point(const char *path)
| ^~~~~~~~~~~~~~~~~~~~~~~~~~~
make[2]: *** [scripts/Makefile.build:122: arch/arc/kernel/asm-offsets.s] Error 1
make[2]: Target '__build' not remade because of errors.
make[1]: *** [Makefile:1284: prepare0] Error 2
make[1]: Target 'prepare' not remade because of errors.
make: *** [Makefile:226: __sub-make] Error 2
make: Target 'prepare' not remade because of errors.


vim +230 include/linux/sysctl.h

226
227 static struct sysctl_header *register_sysctl_mount_point(const char *path)
228 {
229 return NULL
> 230 }
231

---
0-DAY CI Kernel Test Service, Intel Corporation
https://lists.01.org/hyperkitty/list/kbuild-all@lists.01.org
[unhandled content-type:application/gzip]
\
 
 \ /
  Last update: 2021-11-18 03:13    [W:0.080 / U:0.056 seconds]
©2003-2020 Jasper Spaans|hosted at Digital Ocean and TransIP|Read the blog|Advertise on this site